{"text_format":"1","workbook":"xlsx","n_sheets":3,"sheets":["selecteer de teksten","geselecteerde teksten","omzettingstabel"],"not_rendered":{"charts":0,"images":2,"macros":1,"external_links":0,"defined_names":6,"comments":0,"pivot_tables":0},"unopened":[],"bounds":{"document_bytes":16777216,"sheet_cells":100000,"rows_first":2000,"rows_last":500,"rows_between":2000,"halvings":0,"cell_chars":16384,"cell_head_chars":4096},"cells_cut":0,"cells_raw":0,"read":"whole","date_system":"1900"}

{"sheet":"selecteer de teksten","index":0,"n_rows":153,"n_cols":21,"rows_kept":153,"cut":false,"hidden":false,"merged":[[2,14,2,15],[8,14,8,15]]}
[null,"Engels GL/TL"]
[]
[null,null,"jaar","tekst","omschrijving","indicatie moeilijkheidsgraad","P","L","N",null,"ü",null,null,null,"grenswaarden",null,null,"P","L","N","bijdrage"]
[null,null,2011,1,"Tekst 1",{"$f":"IF(G4>P$7,\"makkelijke tekst\",IF(G4<P$6,\"moeilijke tekst\",\"tekst van gemiddelde moeilijkheid\"))","v":"tekst van gemiddelde moeilijkheid"},71.666666666666657,1,0.65000000000000036,null,null,null,null,null,"gemiddelde",{"$f":"AVERAGE(G4:G131)","v":70.105859375000037},null,{"$f":"IF($K4=\"ü\",$G4,\"\")","v":""},{"$f":"IF($K4=\"ü\",$H4,\"\")","v":""},{"$f":"IF($K4=\"ü\",$I4,\"\")","v":""},{"$f":"IF($K4=\"ü\",$G4*$H4,\"\")","v":""}]
[null,null,2011,2,"Tekst 2","makkelijke tekst",87.666666666666657,1,-0.78999999999999915,null,null,null,null,null,"standaarddeviatie",{"$f":"STDEVA(G4:G1334)","v":16.576594612989755},null,"","","",""]
[null,null,2011,3,"Tekst 3","makkelijke tekst",90.666666666666657,1,-1.0599999999999987,null,null,null,null,null,"M-S",{"$f":"P4-P5","v":53.529264762010285},null,"","","",""]
[null,null,2011,4,"Tekst 4","tekst van gemiddelde moeilijkheid",53.666666666666664,1,2.2699999999999996,null,null,null,null,null,"M+S",{"$f":"P4+P5","v":86.682453987989788},null,"","","",""]
[null,null,2011,5,"Tekst 5","tekst van gemiddelde moeilijkheid",68.666666666666657,4,0.92000000000000082,null,null,null,null,null,null,null,null,"","","",""]
[null,null,2011,6,"Tekst 6","tekst van gemiddelde moeilijkheid",57.666666666666664,6,1.9099999999999993,null,null,null,null,null,"gewogen P en N",null,null,"","","",""]
[null,null,2011,7,"Tekst 7","tekst van gemiddelde moeilijkheid",58.666666666666664,2,1.8199999999999994,null,null,null,null,null,"totale bijdrage",{"$f":"SUM(U4:U154)","v":0},null,"","","",""]
[null,null,2011,8,"Tekst 8","moeilijke tekst",46.666666666666664,1,2.8999999999999995,null,null,null,null,null,"gem sc",{"$f":"P10/100","v":0},null,"","","",""]
[null,null,2011,9,"Tekst 9","tekst van gemiddelde moeilijkheid",65.666666666666657,10,1.1900000000000004,null,null,null,null,null,"totale lengte",{"$f":"SUM(S4:S154)","v":0},null,"","","",""]
[null,null,2011,10,"Tekst 10","tekst van gemiddelde moeilijkheid",75.666666666666657,1,0.29000000000000092,null,null,null,null,null,"9*P",{"$f":"IF(P12=0,0,9*P11/P12)","v":0},null,"","","",""]
[null,null,2011,11,"Tekst 11","moeilijke tekst",50.666666666666664,1,2.54,null,null,null,null,null,"n-term",{"$f":"IF(P12=0,1,7.1-P13)","v":1},null,"","","",""]
[null,null,2011,12,"Tekst 12","makkelijke tekst",92.666666666666657,1,-1.2399999999999984,null,null,null,null,null,"afgeronde N",{"$f":"ROUND(P14,1)","v":1},null,"","","",""]
[null,null,2011,13,"Tekst 13","makkelijke tekst",89.666666666666657,1,-0.96999999999999886,null,null,null,null,null,null,null,null,"","","",""]
[null,null,2011,14,"Schrijfopdracht","tekst van gemiddelde moeilijkheid",67.666666666666657,13,1.0100000000000007,null,null,null,null,null,null,null,null,"","","",""]
[null,null,2012,1,"Tekst 1","makkelijke tekst",90.888888888888886,1,-1.08,null,null,null,null,null,null,null,null,"","","",""]
[null,null,2012,2,"Tekst 2","makkelijke tekst",103.88888888888889,1,-2.25,null,null,null,null,null,null,null,null,"","","",""]
[null,null,2012,3,"Tekst 3","tekst van gemiddelde moeilijkheid",78.888888888888886,7,0,null,null,null,null,null,null,null,null,"","","",""]
[null,null,2012,4,"Tekst 4","tekst van gemiddelde moeilijkheid",58.888888888888886,1,1.7999999999999998,null,null,null,null,null,null,null,null,"","","",""]
[null,null,2012,5,"Tekst 5","makkelijke tekst",87.888888888888886,1,-0.8100000000000005,null,null,null,null,null,null,null,null,"","","",""]
[null,null,2012,6,"Tekst 6","tekst van gemiddelde moeilijkheid",72.888888888888886,6,0.54,null,null,null,null,null,null,null,null,"","","",""]
[null,null,2012,7,"Tekst 7","tekst van gemiddelde moeilijkheid",74.888888888888886,7,0.35999999999999943,null,null,null,null,null,null,null,null,"","","",""]
[null,null,2012,8,"Tekst 8","tekst van gemiddelde moeilijkheid",74.888888888888886,2,0.35999999999999943,null,null,null,null,null,null,null,null,"","","",""]
[null,null,2012,9,"Tekst 9","tekst van gemiddelde moeilijkheid",66.888888888888886,7,1.08,null,null,null,null,null,null,null,null,"","","",""]
[null,null,2012,10,"Tekst 10","tekst van gemiddelde moeilijkheid",79.888888888888886,1,-9.0000000000000746E-2,null,null,null,null,null,null,null,null,"","","",""]
[null,null,2012,11,"Tekst 11","makkelijke tekst",99.888888888888886,1,-1.8900000000000006,null,null,null,null,null,null,null,null,"","","",""]
[null,null,2012,12,"Schrijfopdracht","tekst van gemiddelde moeilijkheid",71.888888888888886,13,0.62999999999999989,null,null,null,null,null,null,null,null,"","","",""]
[null,null,2013,1,"Tekst 1","tekst van gemiddelde moeilijkheid",62.888888888888886,2,1.4399999999999995,null,null,null,null,null,null,null,null,"","","",""]
[null,null,2013,2,"Tekst 2","tekst van gemiddelde moeilijkheid",81.068888888888893,2,-0.19620000000000015,null,null,null,null,null,null,null,null,"","","",""]
[null,null,2013,3,"Tekst 3","tekst van gemiddelde moeilijkheid",64.178888888888892,7,1.3238999999999992,null,null,null,null,null,null,null,null,"","","",""]
[null,null,2013,4,"Tekst 4","moeilijke tekst",9.8888888888888875,1,6.21,null,null,null,null,null,null,null,null,"","","",""]
[null,null,2013,5,"Tekst 5","makkelijke tekst",107.88888888888889,1,-2.6100000000000012,null,null,null,null,null,null,null,null,"","","",""]
[null,null,2013,6,"Tekst 6","tekst van gemiddelde moeilijkheid",76.018888888888881,5,0.2583000000000002,null,null,null,null,null,null,null,null,"","","",""]
[null,null,2013,7,"Tekst 7","tekst van gemiddelde moeilijkheid",82.888888888888886,2,-0.36000000000000032,null,null,null,null,null,null,null,null,"","","",""]
[null,null,2013,8,"Tekst 8",{"$f":"IF(G37>P$7,\"makkelijke tekst\",IF(G37<P$6,\"moeilijke tekst\",\"tekst van gemiddelde moeilijkheid\"))","v":"tekst van gemiddelde moeilijkheid"},78.518888888888881,6,3.3299999999999663E-2,null,null,null,null,null,null,null,null,"","","",""]
[null,null,2013,9,"Tekst 9",{"$f":"IF(G38>P$7,\"makkelijke tekst\",IF(G38<P$6,\"moeilijke tekst\",\"tekst van gemiddelde moeilijkheid\"))","v":"tekst van gemiddelde moeilijkheid"},59.888888888888886,2,1.71,null,null,null,null,null,null,null,null,"","","",""]
[null,null,2013,10,"Tekst 10",{"$f":"IF(G39>P$7,\"makkelijke tekst\",IF(G39<P$6,\"moeilijke tekst\",\"tekst van gemiddelde moeilijkheid\"))","v":"tekst van gemiddelde moeilijkheid"},75.888888888888886,1,0.26999999999999957,null,null,null,null,null,null,null,null,"","","",""]
[null,null,2013,11,"Schrijfopdracht",{"$f":"IF(G40>P$7,\"makkelijke tekst\",IF(G40<P$6,\"moeilijke tekst\",\"tekst van gemiddelde moeilijkheid\"))","v":"tekst van gemiddelde moeilijkheid"},76.25888888888889,13,0.23669999999999902,null,null,null,null,null,null,null,null,"","","",""]
[null,null,2014,1,"Tekst 1","tekst van gemiddelde moeilijkheid",67.444444444444443,1,1.0299999999999994,null,null,null,null,null,null,null,null,"","","",""]
[null,null,2014,2,"Tekst 2","tekst van gemiddelde moeilijkheid",64.114444444444445,8,1.3296999999999999,null,null,null,null,null,null,null,null,"","","",""]
[null,null,2014,3,"Tekst 3","tekst van gemiddelde moeilijkheid",62.394444444444439,8,1.4844999999999997,null,null,null,null,null,null,null,null,"","","",""]
[null,null,2014,4,"Tekst 4","moeilijke tekst",41.444444444444436,2,3.37,null,null,null,null,null,null,null,null,"","","",""]
[null,null,2014,5,"Tekst 5","tekst van gemiddelde moeilijkheid",81.974444444444444,5,-0.27770000000000028,null,null,null,null,null,null,null,null,"","","",""]
[null,null,2014,6,"Tekst 6","moeilijke tekst",38.444444444444436,2,3.64,null,null,null,null,null,null,null,null,"","","",""]
[null,null,2014,7,"Tekst 7","tekst van gemiddelde moeilijkheid",65.924444444444433,7,1.1668000000000003,null,null,null,null,null,null,null,null,"","","",""]
[null,null,2014,8,"Tekst 8","makkelijke tekst",91.444444444444443,1,-1.1300000000000008,null,null,null,null,null,null,null,null,"","","",""]
[null,null,2014,9,"Tekst 9","makkelijke tekst",95.444444444444443,1,-1.4900000000000002,null,null,null,null,null,null,null,null,"","","",""]
[null,null,2014,10,"Schrijfopdracht","tekst van gemiddelde moeilijkheid",70.304444444444442,13,0.77259999999999973,null,null,null,null,null,null,null,null,"","","",""]
[null,null,2015,1,"Tekst 1","tekst van gemiddelde moeilijkheid",78.444444444444443,1,4.0000000000000036E-2,null,null,null,null,null,null,null,null,"","","",""]
[null,null,2015,2,"Tekst 2","tekst van gemiddelde moeilijkheid",70.444444444444443,1,0.75999999999999979,null,null,null,null,null,null,null,null,"","","",""]
[null,null,2015,3,"Tekst 3","tekst van gemiddelde moeilijkheid",80.444444444444443,1,-0.14000000000000057,null,null,null,null,null,null,null,null,"","","",""]
[null,null,2015,4,"Tekst 4","tekst van gemiddelde moeilijkheid",63.444444444444436,1,1.3900000000000006,null,null,null,null,null,null,null,null,"","","",""]
[null,null,2015,5,"Tekst 5","tekst van gemiddelde moeilijkheid",57.104444444444432,3,1.9606000000000003,null,null,null,null,null,null,null,null,"","","",""]
[null,null,2015,6,"Tekst 6","moeilijke tekst",50.564444444444433,2,2.5492000000000008,null,null,null,null,null,null,null,null,"","","",""]
[null,null,2015,7,"Tekst 7","tekst van gemiddelde moeilijkheid",82.264444444444436,7,-0.30379999999999896,null,null,null,null,null,null,null,null,"","","",""]
[null,null,2015,8,"Tekst 8","tekst van gemiddelde moeilijkheid",67.904444444444437,6,0.98860000000000081,null,null,null,null,null,null,null,null,"","","",""]
[null,null,2015,9,"Tekst 9","tekst van gemiddelde moeilijkheid",68.734444444444449,6,0.91389999999999993,null,null,null,null,null,null,null,null,"","","",""]
[null,null,2015,10,"Tekst 10","tekst van gemiddelde moeilijkheid",70.444444444444443,1,0.75999999999999979,null,null,null,null,null,null,null,null,"","","",""]
[null,null,2015,11,"Tekst 11","tekst van gemiddelde moeilijkheid",82.444444444444443,2,-0.32000000000000028,null,null,null,null,null,null,null,null,"","","",""]
[null,null,2015,12,"Tekst 12","makkelijke tekst",96.444444444444443,1,-1.58,null,null,null,null,null,null,null,null,"","","",""]
[null,null,2015,13,"Schrijfopdracht","tekst van gemiddelde moeilijkheid",72.484444444444449,12,0.57639999999999958,null,null,null,null,null,null,null,null,"","","",""]
[null,null,2016,1,"Tekst 1","tekst van gemiddelde moeilijkheid",76.485555555555564,1,0.2162999999999986,null,null,null,null,null,null,null,null,"","","",""]
[null,null,2016,2,"Tekst 2","makkelijke tekst",103.97555555555556,1,-2.2577999999999996,null,null,null,null,null,null,null,null,"","","",""]
[null,null,2016,3,"Tekst 3","tekst van gemiddelde moeilijkheid",66.055555555555557,3,1.1549999999999994,null,null,null,null,null,null,null,null,"","","",""]
[null,null,2016,4,"Tekst 4","moeilijke tekst",44.765555555555558,1,3.0710999999999995,null,null,null,null,null,null,null,null,"","","",""]
[null,null,2016,5,"Tekst 5","makkelijke tekst",100.08555555555556,1,-1.9077000000000002,null,null,null,null,null,null,null,null,{"$f":"IF($K68=\"ü\",$G68,\"\")","v":""},{"$f":"IF($K68=\"ü\",$H68,\"\")","v":""},{"$f":"IF($K68=\"ü\",$I68,\"\")","v":""},{"$f":"IF($K68=\"ü\",$G68*$H68,\"\")","v":""}]
[null,null,2016,6,"Tekst 6","moeilijke tekst",45.415555555555557,3,3.0125999999999999,null,null,null,null,null,null,null,null,"","","",""]
[null,null,2016,7,"Tekst 7","tekst van gemiddelde moeilijkheid",83.355555555555554,5,-0.40200000000000102,null,null,null,null,null,null,null,null,"","","",""]
[null,null,2016,8,"Tekst 8","tekst van gemiddelde moeilijkheid",81.355555555555554,6,-0.22200000000000042,null,null,null,null,null,null,null,null,"","","",""]
[null,null,2016,9,"Tekst 9","tekst van gemiddelde moeilijkheid",73.825555555555553,4,0.45570000000000022,null,null,null,null,null,null,null,null,"","","",""]
[null,null,2016,10,"Tekst 10","tekst van gemiddelde moeilijkheid",62.43555555555556,4,1.4807999999999986,null,null,null,null,null,null,null,null,"","","",""]
[null,null,2016,11,"Tekst 11","moeilijke tekst",40.975555555555559,1,3.4121999999999995,null,null,null,null,null,null,null,null,"","","",""]
[null,null,2016,12,"Tekst 12","makkelijke tekst",94.285555555555561,2,-1.3857000000000017,null,null,null,null,null,null,null,null,"","","",""]
[null,null,2016,13,"Tekst 13","tekst van gemiddelde moeilijkheid",81.395555555555561,1,-0.22560000000000091,null,null,null,null,null,null,null,null,"","","",""]
[null,null,2016,14,"Schrijfopdracht","tekst van gemiddelde moeilijkheid",74.615555555555559,12,0.38459999999999894,null,null,null,null,null,null,null,null,"","","",""]
[null,null,2017,1,"Tekst 1","tekst van gemiddelde moeilijkheid",73.555555555555543,1,0.48000000000000043,null,null,null,null,null,null,null,null,"","","",""]
[null,null,2017,2,"Tekst 2","moeilijke tekst",27.55555555555555,2,4.62,null,null,null,null,null,null,null,null,"","","",""]
[null,null,2017,3,"Tekst 3","moeilijke tekst",36.55555555555555,1,3.81,null,null,null,null,null,null,null,null,"","","",""]
[null,null,2017,4,"Tekst 4","makkelijke tekst",91.555555555555543,1,-1.1399999999999988,null,null,null,null,null,null,null,null,"","","",""]
[null,null,2017,5,"Tekst 5","tekst van gemiddelde moeilijkheid",57.635555555555548,2,1.9128000000000007,null,null,null,null,null,null,null,null,"","","",""]
[null,null,2017,6,"Tekst 6","tekst van gemiddelde moeilijkheid",67.60555555555554,4,1.0155000000000012,null,null,null,null,null,null,null,null,"","","",""]
[null,null,2017,7,"Tekst 7","tekst van gemiddelde moeilijkheid",82.955555555555549,6,-0.36599999999999966,null,null,null,null,null,null,null,null,"","","",""]
[null,null,2017,8,"Tekst 8","tekst van gemiddelde moeilijkheid",61.035555555555547,8,1.6068000000000007,null,null,null,null,null,null,null,null,"","","",""]
[null,null,2017,9,"Tekst 9","tekst van gemiddelde moeilijkheid",68.975555555555545,6,0.89220000000000077,null,null,null,null,null,null,null,null,"","","",""]
[null,null,2017,10,"Tekst 10","tekst van gemiddelde moeilijkheid",64.095555555555549,5,1.3314000000000004,null,null,null,null,null,null,null,null,"","","",""]
[null,null,2017,11,"Tekst 11","moeilijke tekst",36.55555555555555,3,3.81,null,null,null,null,null,null,null,null,"","","",""]
[null,null,2017,12,"Tekst 12","tekst van gemiddelde moeilijkheid",79.575555555555539,2,-6.1799999999998967E-2,null,null,null,null,null,null,null,null,"","","",""]
[null,null,2017,13,"Tekst 13","makkelijke tekst",93.555555555555543,1,-1.3199999999999985,null,null,null,null,null,null,null,null,"","","",""]
[null,null,2017,14,"Tekst 14","moeilijke tekst",41.035555555555547,2,3.4068000000000005,null,null,null,null,null,null,null,null,"","","",""]
[null,null,2017,15,"Tekst 15","moeilijke tekst",26.55555555555555,1,4.7100000000000009,null,null,null,null,null,null,null,null,"","","",""]
[null,null,2017,16,"Tekst 16","tekst van gemiddelde moeilijkheid",74.555555555555543,1,0.39000000000000057,null,null,null,null,null,null,null,null,"","","",""]
[null,null,2018,1,"Tekst 1","moeilijke tekst",41.666666666666664,1,3.3499999999999996,null,null,null,null,null,null,null,null,"","","",""]
[null,null,2018,2,"Tekst 2","tekst van gemiddelde moeilijkheid",64.666666666666657,1,1.2800000000000011,null,null,null,null,null,null,null,null,"","","",""]
[null,null,2018,3,"Tekst 3","makkelijke tekst",95.666666666666657,2,-1.5099999999999998,null,null,null,null,null,null,null,null,"","","",""]
[null,null,2018,4,"Tekst 4","tekst van gemiddelde moeilijkheid",76.496666666666655,5,0.21530000000000094,null,null,null,null,null,null,null,null,"","","",""]
[null,null,2018,5,"Tekst 5","tekst van gemiddelde moeilijkheid",83.676666666666662,5,-0.43089999999999939,null,null,null,null,null,null,null,null,"","","",""]
[null,null,2018,6,"Tekst 6","tekst van gemiddelde moeilijkheid",73.666666666666657,2,0.47000000000000064,null,null,null,null,null,null,null,null,"","","",""]
[null,null,2018,7,"Tekst 7","tekst van gemiddelde moeilijkheid",69.216666666666654,3,0.87050000000000072,null,null,null,null,null,null,null,null,"","","",""]
[null,null,2018,8,"Tekst 8","tekst van gemiddelde moeilijkheid",65.326666666666654,9,1.220600000000001,null,null,null,null,null,null,null,null,"","","",""]
[null,null,2018,9,"Tekst 9","tekst van gemiddelde moeilijkheid",60.546666666666667,6,1.6508000000000003,null,null,null,null,null,null,null,null,"","","",""]
[null,null,2018,10,"Tekst 10","tekst van gemiddelde moeilijkheid",68.926666666666662,4,0.89660000000000029,null,null,null,null,null,null,null,null,"","","",""]
[null,null,2018,11,"Tekst 11",{"$f":"IF(G104>P$7,\"makkelijke tekst\",IF(G104<P$6,\"moeilijke tekst\",\"tekst van gemiddelde moeilijkheid\"))","v":"tekst van gemiddelde moeilijkheid"},64.296666666666667,3,1.3132999999999999,null,null,null,null,null,null,null,null,"","","",""]
[null,null,2018,12,"Tekst 12","moeilijke tekst",38.476666666666659,2,3.6371000000000002,null,null,null,null,null,null,null,null,"","","",""]
[null,null,2018,13,"Tekst 13","makkelijke tekst",88.666666666666657,1,-0.87999999999999901,null,null,null,null,null,null,null,null,"","","",""]
[null,null,2018,14,"Tekst 14","tekst van gemiddelde moeilijkheid",72.666666666666657,1,0.5600000000000005,null,null,null,null,null,null,null,null,"","","",""]
[null,null,2019,1,"Tekst 1","makkelijke tekst",97.555555555555557,1,-1.6799999999999997,null,null,null,null,null,null,null,null,"","","",""]
[null,null,2019,2,"Tekst 2","tekst van gemiddelde moeilijkheid",56.555555555555557,2,2.0099999999999998,null,null,null,null,null,null,null,null,"","","",""]
[null,null,2019,3,"Tekst 3","tekst van gemiddelde moeilijkheid",60.555555555555557,1,1.6499999999999995,null,null,null,null,null,null,null,null,"","","",""]
[null,null,2019,4,"Tekst 4","tekst van gemiddelde moeilijkheid",76.425555555555562,6,0.22169999999999934,null,null,null,null,null,null,null,null,"","","",""]
[null,null,2019,5,"Tekst 5","tekst van gemiddelde moeilijkheid",65.155555555555551,6,1.2359999999999998,null,null,null,null,null,null,null,null,"","","",""]
[null,null,2019,6,"Tekst 6","tekst van gemiddelde moeilijkheid",68.695555555555558,7,0.91739999999999977,null,null,null,null,null,null,null,null,"","","",""]
[null,null,2019,7,"Tekst 7","tekst van gemiddelde moeilijkheid",66.545555555555552,7,1.1109,null,null,null,null,null,null,null,null,"","","",""]
[null,null,2019,8,"Tekst 8","tekst van gemiddelde moeilijkheid",55.555555555555557,6,2.0999999999999996,null,null,null,null,null,null,null,null,"","","",""]
[null,null,2019,9,"Tekst 9","tekst van gemiddelde moeilijkheid",56.845555555555556,5,1.9838999999999993,null,null,null,null,null,null,null,null,"","","",""]
[null,null,2019,10,"Tekst 10","moeilijke tekst",44.515555555555558,3,3.0935999999999995,null,null,null,null,null,null,null,null,"","","",""]
[null,null,2019,11,"Tekst 11","moeilijke tekst",42.555555555555557,1,3.2699999999999996,null,null,null,null,null,null,null,null,"","","",""]
[null,null,2019,12,"Tekst 12","makkelijke tekst",97.555555555555557,1,-1.6799999999999997,null,null,null,null,null,null,null,null,"","","",""]
[null,null,2021,1,"Tekst 1","tekst van gemiddelde moeilijkheid",83.444444444444443,1,-0.41000000000000014,null,null,null,null,null,null,null,null,"","","",""]
[null,null,2021,2,"Tekst 2","tekst van gemiddelde moeilijkheid",69.174444444444447,3,0.87429999999999897,null,null,null,null,null,null,null,null,"","","",""]
[null,null,2021,3,"Tekst 3","tekst van gemiddelde moeilijkheid",67.924444444444433,2,0.98680000000000057,null,null,null,null,null,null,null,null,"","","",""]
[null,null,2021,4,"Tekst 4","tekst van gemiddelde moeilijkheid",79.444444444444443,3,-5.0000000000000711E-2,null,null,null,null,null,null,null,null,"","","",""]
[null,null,2021,5,"Tekst 5","tekst van gemiddelde moeilijkheid",82.364444444444445,7,-0.31280000000000019,null,null,null,null,null,null,null,null,"","","",""]
[null,null,2021,6,"Tekst 6","tekst van gemiddelde moeilijkheid",63.774444444444434,9,1.3603000000000005,null,null,null,null,null,null,null,null,"","","",""]
[null,null,2021,7,"Tekst 7","moeilijke tekst",53.304444444444435,5,2.3026000000000009,null,null,null,null,null,null,null,null,"","","",""]
[null,null,2021,8,"Tekst 8","tekst van gemiddelde moeilijkheid",77.944444444444443,6,8.4999999999999964E-2,null,null,null,null,null,null,null,null,"","","",""]
[null,null,2021,9,"Tekst 9","tekst van gemiddelde moeilijkheid",69.064444444444447,5,0.88419999999999899,null,null,null,null,null,null,null,null,"","","",""]
[null,null,2021,10,"Tekst 10","tekst van gemiddelde moeilijkheid",76.87444444444445,2,0.18129999999999935,null,null,null,null,null,null,null,null,"","","",""]
[null,null,2021,11,"Tekst 11","tekst van gemiddelde moeilijkheid",78.444444444444443,1,4.0000000000000036E-2,null,null,null,null,null,null,null,null,"","","",""]
[null,null,2021,12,"Tekst 12","tekst van gemiddelde moeilijkheid",72.444444444444443,2,0.58000000000000007,null,null,null,null,null,null,null,null,"","","",""]
[null,null,2022,1,"Tekst 1","tekst van gemiddelde moeilijkheid",71.555555555555557,1,0.65999999999999925,null,null,null,null,null,null,null,null,"","","",""]
[null,null,2022,2,"Tekst 2","tekst van gemiddelde moeilijkheid",86.555555555555557,3,-0.69000000000000039,null,null,null,null,null,null,null,null,{"$f":"IF($K133=\"ü\",$G133,\"\")","v":""},{"$f":"IF($K133=\"ü\",$H133,\"\")","v":""},{"$f":"IF($K133=\"ü\",$I133,\"\")","v":""},{"$f":"IF($K133=\"ü\",$G133*$H133,\"\")","v":""}]
[null,null,2022,3,"Tekst 3","tekst van gemiddelde moeilijkheid",76.555555555555557,2,0.20999999999999996,null,null,null,null,null,null,null,null,"","","",""]
[null,null,2022,4,"Tekst 4","tekst van gemiddelde moeilijkheid",75.525555555555556,5,0.30269999999999975,null,null,null,null,null,null,null,null,"","","",""]
[null,null,2022,5,"Tekst 5","tekst van gemiddelde moeilijkheid",75.185555555555553,6,0.33330000000000037,null,null,null,null,null,null,null,null,"","","",""]
[null,null,2022,6,"Tekst 6","tekst van gemiddelde moeilijkheid",69.135555555555555,6,0.87779999999999969,null,null,null,null,null,null,null,null,"","","",""]
[null,null,2022,7,"Tekst 7","tekst van gemiddelde moeilijkheid",65.645555555555561,6,1.1918999999999986,null,null,null,null,null,null,null,null,"","","",""]
[null,null,2022,8,"Tekst 8","tekst van gemiddelde moeilijkheid",61.205555555555556,8,1.591499999999999,null,null,null,null,null,null,null,null,"","","",""]
[null,null,2022,9,"Tekst 9","makkelijke tekst",91.645555555555561,6,-1.1481000000000012,null,null,null,null,null,null,null,null,"","","",""]
[null,null,2022,10,"Tekst 10","tekst van gemiddelde moeilijkheid",67.105555555555554,2,1.0604999999999993,null,null,null,null,null,null,null,null,"","","",""]
[null,null,2022,11,"Tekst 11","makkelijke tekst",91.555555555555557,1,-1.1400000000000006,null,null,null,null,null,null,null,null,"","","",""]
[null,null,2023,1,"Traveller information","tekst van gemiddelde moeilijkheid",81,1,-0.19000000000000039,null,null,null,null,null,null,null,null,"","","",""]
[null,null,2023,2,"Hug a tree","tekst van gemiddelde moeilijkheid",75,1,0.34999999999999964,null,null,null,null,null,null,null,null,"","","",""]
[null,null,2023,3,"When it rains cats and dogs, in come the mice","tekst van gemiddelde moeilijkheid",80,5,-0.10000000000000053,null,null,null,null,null,null,null,null,"","","",""]
[null,null,2023,4,"How Jamaican bobsledders train for the Olympics","makkelijke tekst",87,6,-0.73000000000000043,null,null,null,null,null,null,null,null,"","","",""]
[null,null,2023,5,"Bears and wolves to coexist in UK woods for first time","tekst van gemiddelde moeilijkheid",67,7,1.0699999999999994,null,null,null,null,null,null,null,null,"","","",""]
[null,null,2023,6,"Smokejumpers","tekst van gemiddelde moeilijkheid",81,8,-0.19000000000000039,null,null,null,null,null,null,null,null,"","","",""]
[null,null,2023,7,"When the friend who has your back is a horse","tekst van gemiddelde moeilijkheid",73,8,0.52999999999999936,null,null,null,null,null,null,null,null,"","","",""]
[null,null,2023,8,"Riders in the storm","tekst van gemiddelde moeilijkheid",72,6,0.61999999999999922,null,null,null,null,null,null,null,null,"","","",""]
[null,null,2023,9,"Travel beyond your wildest dreams","tekst van gemiddelde moeilijkheid",76,1,0.25999999999999979,null,null,null,null,null,null,null,null,"","","",""]
[null,null,2023,10,"Tips to ditch single-use plastic","tekst van gemiddelde moeilijkheid",85,2,-0.55000000000000071,null,null,null,null,null,null,null,null,"","","",""]
[null,null,2023,11,"Monsters","tekst van gemiddelde moeilijkheid",55,1,2.1499999999999995,null,null,null,null,null,null,null,null,"","","",""]

{"sheet":"geselecteerde teksten","index":1,"n_rows":10,"n_cols":7,"rows_kept":10,"cut":false,"hidden":false,"merged":[[11,4,11,5],[10,4,10,5],[9,4,9,5]]}
[null,"Engels GL/TL"]
[]
[null,null,"inhoud van de toets"]
[]
[null,null,"schaallengte",null,{"$f":"'selecteer de teksten'!P12","v":0}]
[null,null,"N-term",null,{"$f":"'selecteer de teksten'!P15","v":1}]
[]
[null,null,"teksten in chronologische volgorde"]
[]
[null,null,"jaar","tekst","omschrijving",null,"punten"]

{"sheet":"omzettingstabel","index":2,"n_rows":6,"n_cols":16,"rows_kept":6,"cut":false,"hidden":false,"merged":[]}
[]
[null,"Vaknaam:",null,null,null,{"$f":"'selecteer de teksten'!B1","v":"Engels GL/TL"}]
[null,"Schaallengte:",null,null,null,0]
[null,"Normeringsterm:",null,null,null,1]
[]
[null,null,null,null,null,null,null,null,null,null,null,null,null,null,null,"####"]